BDBM50151080 (S)-3-{(S)-2-[(S)-2-((S)-2-{(S)-2-[(S)-2-((S)-2-Amino-propionylamino)-4-carbamoyl-butyrylamino]-4-methyl-pentanoylamino}-3-carboxy-propionylamino)-4-methyl-pentanoylamino]-propionylamino}-N-carboxymethyl-succinamic acid::CHEMBL362775
SMILES CC(C)C[C@H](NC(=O)[C@H](CC(O)=O)NC(=O)[C@H](CC(C)C)NC(=O)[C@H](CCC(N)=O)NC(=O)[C@H](C)N)C(=O)N[C@@H](C)C(=O)N[C@@H](CC(O)=O)C(=O)NCC(O)=O
InChI Key InChIKey=WATLSOAGBAUOSK-CPDXTSBQSA-N
Data  1 IC50
  Tab Delimited (TSV)   2D SDfile   Computed 3D by Vconf -m prep SDfile
Find this compound or compounds like it in BindingDB:
Activity Spreadsheet -- Enzyme Inhibition Constant Data from BindingDB
Found 1 hit for monomerid = 50151080
TargetProtein c-Fos/Transcription factor Jun(Homo sapiens (Human))
Toyama Chemical
Curated by ChEMBL
LigandPNGBDBM50151080((S)-3-{(S)-2-[(S)-2-((S)-2-{(S)-2-[(S)-2-((S)-2-Am...)
Affinity DataIC50: >1.00E+5nM. Assay description: Inhibitory activity against transcription activator protein-1 (AP-1)
In DepthDetails ArticlePubMed