BDBM50151084 (S)-3-{(S)-2-[(S)-2-((S)-2-{(S)-2-[(S)-2-(2-Amino-acetylamino)-4-carbamoyl-butyrylamino]-4-methyl-pentanoylamino}-3-carboxy-propionylamino)-4-methyl-pentanoylamino]-propionylamino}-N-((S)-1-carboxy-ethyl)-succinamic acid::CHEMBL186448
SMILES CC(C)C[C@H](NC(=O)[C@H](CC(O)=O)NC(=O)[C@H](CC(C)C)NC(=O)[C@H](CCC(N)=O)NC(=O)CN)C(=O)N[C@@H](C)C(=O)N[C@@H](CC(O)=O)C(=O)N[C@@H](C)C(O)=O
InChI Key InChIKey=KXNFHGFGGYLUCD-CPDXTSBQSA-N
Data  1 IC50
  Tab Delimited (TSV)   2D SDfile   Computed 3D by Vconf -m prep SDfile
Find this compound or compounds like it in BindingDB:
Activity Spreadsheet -- Enzyme Inhibition Constant Data from BindingDB
Found 1 hit for monomerid = 50151084
TargetProtein c-Fos/Transcription factor Jun(Homo sapiens (Human))
Toyama Chemical
Curated by ChEMBL
LigandPNGBDBM50151084((S)-3-{(S)-2-[(S)-2-((S)-2-{(S)-2-[(S)-2-(2-Amino-...)
Affinity DataIC50: >1.00E+5nM. Assay description: Inhibitory activity against transcription activator protein-1 (AP-1)
In DepthDetails ArticlePubMed