BDBM50151093 (S)-4-(2-Amino-acetylamino)-4-{(S)-1-[(S)-2-carboxy-1-((S)-1-{(S)-1-[(S)-2-carboxy-1-(carboxymethyl-carbamoyl)-ethylcarbamoyl]-ethylcarbamoyl}-3-methyl-butylcarbamoyl)-ethylcarbamoyl]-3-methyl-butylcarbamoyl}-butyric acid::CHEMBL183359
SMILES CC(C)C[C@H](NC(=O)[C@H](CC(O)=O)NC(=O)[C@H](CC(C)C)NC(=O)[C@H](CCC(O)=O)NC(=O)CN)C(=O)N[C@@H](C)C(=O)N[C@@H](CC(O)=O)C(=O)NCC(O)=O
InChI Key InChIKey=HVLXXSQCJBOSGR-PXQJOHHUSA-N
Data  1 IC50
  Tab Delimited (TSV)   2D SDfile   Computed 3D by Vconf -m prep SDfile
Find this compound or compounds like it in BindingDB:
Activity Spreadsheet -- Enzyme Inhibition Constant Data from BindingDB
Found 1 hit for monomerid = 50151093
TargetProtein c-Fos/Transcription factor Jun(Homo sapiens (Human))
Toyama Chemical
Curated by ChEMBL
LigandPNGBDBM50151093((S)-4-(2-Amino-acetylamino)-4-{(S)-1-[(S)-2-carbox...)
Affinity DataIC50: >2.00E+5nM. Assay description: Inhibitory activity against transcription activator protein-1 (AP-1)
In DepthDetails ArticlePubMed