BDBM50151139 2-Adamantan-1-yl-4-oxo-4H-chromene-6-carboxylic acid methyl ester::CHEMBL185877
SMILES COC(=O)c1ccc2oc(cc(=O)c2c1)C12CC3CC(CC(C3)C1)C2
InChI Key InChIKey=HYOJJXADACTQIE-UHFFFAOYSA-N
Data  1 KI  3 IC50
  Tab Delimited (TSV)   2D SDfile   Computed 3D by Vconf -m prep SDfile
Find this compound or compounds like it in BindingDB:
Activity Spreadsheet -- Enzyme Inhibition Constant Data from BindingDB
Found 4 hits for monomerid = 50151139
TargetSteryl-sulfatase(Homo sapiens (Human))
Novartis Institute For Biomedical Research Vienna
Curated by ChEMBL
LigandPNGBDBM50151139(2-Adamantan-1-yl-4-oxo-4H-chromene-6-carboxylic ac...)
Affinity DataKi: >5.00E+4nM. Assay description: Inhibitory activity against human steroid sulfatase
In DepthDetails ArticlePubMed
TargetSteryl-sulfatase(Homo sapiens (Human))
Novartis Institute For Biomedical Research Vienna
Curated by ChEMBL
LigandPNGBDBM50151139(2-Adamantan-1-yl-4-oxo-4H-chromene-6-carboxylic ac...)
Affinity DataIC50: >3.00E+4nM. Assay description: Inhibitory activity against human steroid sulfatase over-expressed in CHO cells
In DepthDetails ArticlePubMed
TargetSteryl-sulfatase(Homo sapiens (Human))
Novartis Institute For Biomedical Research Vienna
Curated by ChEMBL
LigandPNGBDBM50151139(2-Adamantan-1-yl-4-oxo-4H-chromene-6-carboxylic ac...)
Affinity DataIC50: >530nM. Assay description: Inhibition of recombinant human estrone sulfatase using 4-methylumbelliferyl sulfate as substrate by colorimetric assay
In DepthDetails ArticlePubMed
TargetSteryl-sulfatase(Homo sapiens (Human))
Novartis Institute For Biomedical Research Vienna
Curated by ChEMBL
LigandPNGBDBM50151139(2-Adamantan-1-yl-4-oxo-4H-chromene-6-carboxylic ac...)
Affinity DataIC50: >180nM. Assay description: Inhibition of recombinant human estrone sulfatase expressed in CHO cells using 4-methylumbelliferyl sulfate as substrate by fluorimetric assay
In DepthDetails ArticlePubMed