BDBM50152027 5-{4-[4-(5-Cyano-1H-indol-3-yl)-butyl]-piperazin-1-yl}-benzo[b]thiophene-2-carboxylic acid amide::CHEMBL185764
SMILES NC(=O)c1cc2cc(ccc2s1)N1CCN(CCCCc2c[nH]c3ccc(cc23)C#N)CC1
InChI Key InChIKey=MVZZXNPQYQCSTB-UHFFFAOYSA-N
Data  2 IC50
  Tab Delimited (TSV)   2D SDfile   Computed 3D by Vconf -m prep SDfile
Find this compound or compounds like it in BindingDB:
Activity Spreadsheet -- Enzyme Inhibition Constant Data from BindingDB
Found 2 hits for monomerid = 50152027
TargetSodium-dependent serotonin transporter(Rattus norvegicus (rat))
Merck
Curated by ChEMBL
LigandPNGBDBM50152027(5-{4-[4-(5-Cyano-1H-indol-3-yl)-butyl]-piperazin-1...)
Affinity DataIC50:  0.300nM. Assay description: Inhibition of [3H]-5-HT re-uptake in rat synaptosomes
In DepthDetails ArticlePubMed
Target5-hydroxytryptamine receptor 1A(Rattus norvegicus (rat))
Merck
Curated by ChEMBL
LigandPNGBDBM50152027(5-{4-[4-(5-Cyano-1H-indol-3-yl)-butyl]-piperazin-1...)
Affinity DataIC50:  3.10nM. Assay description: Inhibition of 8-OH DPAT binding to rat hydroxytryptamine 1A receptor expresssed in CHO cells
In DepthDetails ArticlePubMed