BDBM50154316 CHEMBL3775224
SMILES CCCC(=O)Oc1ccc(cc1)C(=C(\C)c1ccccc1)\c1ccc(OCCN2CCCC2)cc1
InChI Key InChIKey=WOYOHLGLNFXJCR-QLTSDVKISA-N
Data  1 IC50
  Tab Delimited (TSV)   2D SDfile   Computed 3D by Vconf -m prep SDfile
Find this compound or compounds like it in BindingDB:
Activity Spreadsheet -- Enzyme Inhibition Constant Data from BindingDB
Found 1 hit for monomerid = 50154316
TargetEstrogen receptor(Homo sapiens (Human))
German University In Cairo
Curated by ChEMBL
LigandPNGBDBM50154316(CHEMBL3775224)
Affinity DataIC50:  27nM. Assay description: Displacement of [3H]-E2 from human ER-alpha incubated for 16 to 20 hrs by liquid scintillation counting analysis
In DepthDetails ArticlePubMed