BDBM50155206 CHEMBL186511::N-(5-Cyclopentyl-thiazol-2-yl)-2-phenyl-acetamide
SMILES O=C(Cc1ccccc1)Nc1ncc(s1)C1CCCC1
InChI Key InChIKey=QQXOHTCNPILOGG-UHFFFAOYSA-N
Data  2 IC50
  Tab Delimited (TSV)   2D SDfile   Computed 3D by Vconf -m prep SDfile
Find this compound or compounds like it in BindingDB:
Activity Spreadsheet -- Enzyme Inhibition Constant Data from BindingDB
Found 2 hits for monomerid = 50155206
TargetCyclin-dependent kinase 5(Homo sapiens (Human))
Pfizer
Curated by ChEMBL
LigandPNGBDBM50155206(CHEMBL186511 | N-(5-Cyclopentyl-thiazol-2-yl)-2-ph...)
Affinity DataIC50:  64nM. Assay description: Concentration required for inhibition of cyclin-dependent kinase 5 was measured by scintillation proximity assay
In DepthDetails ArticlePubMed
TargetCyclin-dependent kinase 2/G1/S-specific cyclin-E1(Homo sapiens (Human))
Pfizer
Curated by ChEMBL
LigandPNGBDBM50155206(CHEMBL186511 | N-(5-Cyclopentyl-thiazol-2-yl)-2-ph...)
Affinity DataIC50:  155nM. Assay description: Concentration required for inhibition of cyclin dependant kinase 2-cyclin E was measured by scintillation proximity assay
In DepthDetails ArticlePubMed