BDBM50155565 CHEMBL185775::Piperidine-1-carboxylic acid [4-methyl-3-(4-pyridin-3-yl-pyrimidin-2-ylamino)-phenyl]-amide
SMILES Cc1ccc(NC(=O)N2CCCCC2)cc1Nc1nccc(n1)-c1cccnc1
InChI Key InChIKey=JEQAFPBGTZWZSQ-UHFFFAOYSA-N
Data  3 IC50
  Tab Delimited (TSV)   2D SDfile   Computed 3D by Vconf -m prep SDfile
Find this compound or compounds like it in BindingDB:
Activity Spreadsheet -- Enzyme Inhibition Constant Data from BindingDB
Found 3 hits for monomerid = 50155565
TargetTyrosine-protein kinase ABL1(Homo sapiens (Human))
Novartis Institutes For Biomedical Research
Curated by ChEMBL
LigandPNGBDBM50155565(CHEMBL185775 | Piperidine-1-carboxylic acid [4-met...)
Affinity DataIC50:  930nM. Assay description: Inhibitory concentration required to inhibit Abl tyrosine kinase
In DepthDetails ArticlePubMed
TargetBreakpoint cluster region protein/Tyrosine-protein kinase ABL1(Homo sapiens (Human))
The First People'S Hospital Of Hangzhou
Curated by ChEMBL
LigandPNGBDBM50155565(CHEMBL185775 | Piperidine-1-carboxylic acid [4-met...)
Affinity DataIC50:  1.00E+4nM. Assay description: Inhibition of BCR-ABL kinase (unknown origin)
In DepthDetails ArticlePubMed
TargetBreakpoint cluster region protein(Homo sapiens (Human))
Novartis Institutes For Biomedical Research
Curated by ChEMBL
LigandPNGBDBM50155565(CHEMBL185775 | Piperidine-1-carboxylic acid [4-met...)
Affinity DataIC50: >1.00E+4nM. Assay description: Inhibitory concentration required to inhibit Bcr-Abl tyrosine kinase
In DepthDetails ArticlePubMed