BDBM50155589 CHEMBL185815::Dimethyl-[4-({methyl-[2-(4-nitro-phenyl)-ethyl]-amino}-methyl)-phenyl]-amine
SMILES CN(C)c1ccc(CN(C)CCc2ccc(cc2)[N+]([O-])=O)cc1
InChI Key InChIKey=BSAGGLRYMVSSTQ-UHFFFAOYSA-N
Data  1 IC50
  Tab Delimited (TSV)   2D SDfile   Computed 3D by Vconf -m prep SDfile
Find this compound or compounds like it in BindingDB:
Activity Spreadsheet -- Enzyme Inhibition Constant Data from BindingDB
Found 1 hit for monomerid = 50155589
TargetM-phase inducer phosphatase 3(Homo sapiens (Human))
Institut Henri Beaufour
Curated by ChEMBL
LigandPNGBDBM50155589(CHEMBL185815 | Dimethyl-[4-({methyl-[2-(4-nitro-ph...)
Affinity DataIC50: >8.00E+4nM. Assay description: Inhibitory concentration for human cell division cycle 25 degree C phosphatase; not active
In DepthDetails ArticlePubMed