BDBM50156545 CHEMBL3793226
SMILES Fc1ccc2ccc(=O)n3C[C@@H](CN4CCC(CC4)NCc4cc5OCCOc5nn4)c1c23
InChI Key InChIKey=SRICOHRDRMZREQ-MRXNPFEDSA-N
Data  1 IC50
PDB links: 3 PDB IDs match this monomer.
  Tab Delimited (TSV)   2D SDfile   Computed 3D by Vconf -m prep SDfile
Find this compound or compounds like it in BindingDB:
Activity Spreadsheet -- Enzyme Inhibition Constant Data from BindingDB
Found 1 hit for monomerid = 50156545
TargetPotassium voltage-gated channel subfamily H member 2(Homo sapiens (Human))
Glaxosmithkline
Curated by ChEMBL
LigandPNGBDBM50156545(CHEMBL3793226)
Affinity DataIC50:  2.38E+5nM. Assay description: Inhibition of human ERG
In DepthDetails ArticlePubMed