BDBM50156574 1-(3-azidomethyl-2,3-dideoxy-2-fluoro-beta-D-ribofuranosyl)thymine::CHEMBL223811
SMILES Cc1cn([C@@H]2O[C@H](CO)[C@@H](CN=[N+]=[N-])[C@H]2F)c(=O)[nH]c1=O
InChI Key InChIKey=WORYJBRRZBUKMP-FDDDBJFASA-N
Data  1 KI
  Tab Delimited (TSV)   2D SDfile   Computed 3D by Vconf -m prep SDfile
Find this compound or compounds like it in BindingDB:
Activity Spreadsheet -- Enzyme Inhibition Constant Data from BindingDB
Found 1 hit for monomerid = 50156574
TargetThymidylate kinase(Mycobacterium tuberculosis)
Ghent University
Curated by ChEMBL
LigandPNGBDBM50156574(1-(3-azidomethyl-2,3-dideoxy-2-fluoro-beta-D-ribof...)
Affinity DataKi:  1.65E+5nM. Assay description: Inhibition of Mycobacterium tuberculosis TMPK by coupled spectrophotometric assay
In DepthDetails ArticlePubMed