BDBM50157072 CHEMBL367757::{(R)-4-[(10aS,12aR)-8-(3-Hydroxy-benzyl)-10a,12a-dimethyl-1,2,3,3a,3b,4,5,5a,6,8,10,10a,10b,11,12,12a-hexadecahydro-7,8-diaza-dicyclopenta[a,h]phenanthren-1-yl]-pentanoylamino}-acetic acid
SMILES C[C@H](CCC(=O)NCC(O)=O)C1CCC2C3CCC4Cc5nn(Cc6cccc(O)c6)cc5C[C@]4(C)C3CC[C@]12C
InChI Key InChIKey=FNHQXWQXKBFUCM-UYWQNWCGSA-N
Data  2 IC50
  Tab Delimited (TSV)   2D SDfile   Computed 3D by Vconf -m prep SDfile
Find this compound or compounds like it in BindingDB:
Activity Spreadsheet -- Enzyme Inhibition Constant Data from BindingDB
Found 2 hits for monomerid = 50157072
TargetSodium/bile acid cotransporter(Homo sapiens (Human))
Xenoport
Curated by ChEMBL
LigandPNGBDBM50157072(CHEMBL367757 | {(R)-4-[(10aS,12aR)-8-(3-Hydroxy-be...)
Affinity DataIC50:  300nM. Assay description: In vitro inhibition of taurocholate binding to liver bile acid transporter expressed in CHO cells
In DepthDetails ArticlePubMed
TargetIleal sodium/bile acid cotransporter(Homo sapiens (Human))
Xenoport
Curated by ChEMBL
LigandPNGBDBM50157072(CHEMBL367757 | {(R)-4-[(10aS,12aR)-8-(3-Hydroxy-be...)
Affinity DataIC50:  900nM. Assay description: In vitro inhibition of taurocholate binding to human ileal bile acid transporter expressed in CHO cells
In DepthDetails ArticlePubMed