BDBM50157115 2-[2-(6-Phenyl-hexane-1-sulfonyl)-oxazol-5-yl]-pyridine::CHEMBL183663
SMILES O=S(=O)(CCCCCCc1ccccc1)c1ncc(o1)-c1ccccn1
InChI Key InChIKey=ROBPAHYOHGTRBT-UHFFFAOYSA-N
Data  1 KI
  Tab Delimited (TSV)   2D SDfile   Computed 3D by Vconf -m prep SDfile
Find this compound or compounds like it in BindingDB:
Activity Spreadsheet -- Enzyme Inhibition Constant Data from BindingDB
Found 1 hit for monomerid = 50157115
TargetFatty-acid amide hydrolase 1 [30-579](Rattus norvegicus (rat))
The Scripps Research Institute
Curated by ChEMBL
LigandPNGBDBM50157115(2-[2-(6-Phenyl-hexane-1-sulfonyl)-oxazol-5-yl]-pyr...)
Affinity DataKi:  1.60E+4nM. Assay description: Binding affinity against purified rat Fatty-acid amide hydrolase (FAAH) expressed in Escherichia coli
In DepthDetails ArticlePubMed