BDBM50157133 2-[5-(6-Phenyl-hexylsulfanyl)-[1,3,4]oxadiazol-2-yl]-pyridine::CHEMBL183622
SMILES C(CCSc1nnc(o1)-c1ccccn1)CCc1ccccc1
InChI Key InChIKey=KVEHPKXALGTNAF-UHFFFAOYSA-N
Data  1 KI
  Tab Delimited (TSV)   2D SDfile   Computed 3D by Vconf -m prep SDfile
Find this compound or compounds like it in BindingDB:
Activity Spreadsheet -- Enzyme Inhibition Constant Data from BindingDB
Found 1 hit for monomerid = 50157133
TargetFatty-acid amide hydrolase 1 [30-579](Rattus norvegicus (rat))
The Scripps Research Institute
Curated by ChEMBL
LigandPNGBDBM50157133(2-[5-(6-Phenyl-hexylsulfanyl)-[1,3,4]oxadiazol-2-y...)
Affinity DataKi:  1.10E+5nM. Assay description: Binding affinity against purified rat Fatty-acid amide hydrolase (FAAH) expressed in Escherichia coli
In DepthDetails ArticlePubMed