BDBM50157135 2-[2-(6-Phenyl-hexane-1-sulfinyl)-oxazol-5-yl]-pyridine::CHEMBL183662
SMILES O=S(CCCCCCc1ccccc1)c1ncc(o1)-c1ccccn1
InChI Key InChIKey=GDMQOSJIGVIUJW-UHFFFAOYSA-N
Data  1 KI
  Tab Delimited (TSV)   2D SDfile   Computed 3D by Vconf -m prep SDfile
Find this compound or compounds like it in BindingDB:
Activity Spreadsheet -- Enzyme Inhibition Constant Data from BindingDB
Found 1 hit for monomerid = 50157135
TargetFatty-acid amide hydrolase 1 [30-579](Rattus norvegicus (rat))
The Scripps Research Institute
Curated by ChEMBL
LigandPNGBDBM50157135(2-[2-(6-Phenyl-hexane-1-sulfinyl)-oxazol-5-yl]-pyr...)
Affinity DataKi:  1.10E+4nM. Assay description: Binding affinity against purified rat Fatty-acid amide hydrolase (FAAH) expressed in Escherichia coli
In DepthDetails ArticlePubMed