BDBM50157140 2-{5-[((Z)-Heptadec-8-enyl)sulfanyl]-[1,3,4]oxadiazol-2-yl}-pyridine::CHEMBL182872
SMILES CCCCCCCC\C=C/CCCCCCCSc1nnc(o1)-c1ccccn1
InChI Key InChIKey=DQBQQCMDZPIFFM-KTKRTIGZSA-N
Data  1 KI
  Tab Delimited (TSV)   2D SDfile   Computed 3D by Vconf -m prep SDfile
Find this compound or compounds like it in BindingDB:
Activity Spreadsheet -- Enzyme Inhibition Constant Data from BindingDB
Found 1 hit for monomerid = 50157140
TargetFatty-acid amide hydrolase 1 [30-579](Rattus norvegicus (rat))
The Scripps Research Institute
Curated by ChEMBL
LigandPNGBDBM50157140(2-{5-[((Z)-Heptadec-8-enyl)sulfanyl]-[1,3,4]oxadia...)
Affinity DataKi:  1.40E+5nM. Assay description: Binding affinity against purified rat Fatty-acid amide hydrolase (FAAH) expressed in Escherichia coli
In DepthDetails ArticlePubMed