BDBM50157141 2-[5-(6-Phenyl-hexane-1-sulfinyl)-[1,3,4]oxadiazol-2-yl]-pyridine::CHEMBL183490
SMILES O=S(CCCCCc1ccccc1)c1nnc(o1)-c1ccccn1
InChI Key InChIKey=UTMOIPHAMPLBPE-UHFFFAOYSA-N
Data  1 KI
  Tab Delimited (TSV)   2D SDfile   Computed 3D by Vconf -m prep SDfile
Find this compound or compounds like it in BindingDB:
Activity Spreadsheet -- Enzyme Inhibition Constant Data from BindingDB
Found 1 hit for monomerid = 50157141
TargetFatty-acid amide hydrolase 1 [30-579](Rattus norvegicus (rat))
The Scripps Research Institute
Curated by ChEMBL
LigandPNGBDBM50157141(2-[5-(6-Phenyl-hexane-1-sulfinyl)-[1,3,4]oxadiazol...)
Affinity DataKi:  4.90E+3nM. Assay description: Binding affinity against purified rat Fatty-acid amide hydrolase (FAAH) expressed in Escherichia coli
In DepthDetails ArticlePubMed