BDBM50157168 2-{Cyclohexyl-[4-(3,4-dichloro-phenoxy)-benzoyl]-amino}-thiazole-5-carboxylic acid::CHEMBL361161
SMILES OC(=O)c1cnc(s1)N(C1CCCCC1)C(=O)c1ccc(Oc2ccc(Cl)c(Cl)c2)cc1
InChI Key InChIKey=ZJWHRYRKEJQLRN-UHFFFAOYSA-N
Data  1 IC50
  Tab Delimited (TSV)   2D SDfile   Computed 3D by Vconf -m prep SDfile
Find this compound or compounds like it in BindingDB:
Activity Spreadsheet -- Enzyme Inhibition Constant Data from BindingDB
Found 1 hit for monomerid = 50157168
TargetRNA-directed RNA polymerase(Hepatitis C virus)
Neogenesis Pharmaceuticals
Curated by ChEMBL
LigandPNGBDBM50157168(2-{Cyclohexyl-[4-(3,4-dichloro-phenoxy)-benzoyl]-a...)
Affinity DataIC50:  2.60E+3nM. Assay description: Inhibitory concentration against RNA dependent RNA polymerase nonstructural protein 5B of hepatitis C virus
In DepthDetails ArticlePubMed