BDBM50157703 CHEMBL3785133
SMILES FC(Cc1noc(Cn2cnc3ncccc3c2=O)n1)c1ccc(Cl)cc1
InChI Key InChIKey=PJMMWANXHNLCLA-UHFFFAOYSA-N
Data  2 IC50
  Tab Delimited (TSV)   2D SDfile   Computed 3D by Vconf -m prep SDfile
Find this compound or compounds like it in BindingDB:
Activity Spreadsheet -- Enzyme Inhibition Constant Data from BindingDB
Found 2 hits for monomerid = 50157703
LigandPNGBDBM50157703(CHEMBL3785133)
Affinity DataIC50:  31nM. Assay description: Antagonist activity at rat TRPA1 expressed in tetracycline-inducible T-REx expression system transfected CHO cells assessed as inhibition of AITC-ind...
In DepthDetails ArticlePubMed
LigandPNGBDBM50157703(CHEMBL3785133)
Affinity DataIC50:  41nM. Assay description: Antagonist activity at human TRPA1 expressed in tetracycline-inducible T-REx expression system transfected CHO cells assessed as inhibition of AITC-i...
In DepthDetails ArticlePubMed