BDBM50159275 1,6-DMN::1,6-Dimethylnaphthalene::CHEMBL363803
SMILES Cc1ccc2c(C)cccc2c1
InChI Key InChIKey=CBMXCNPQDUJNHT-UHFFFAOYSA-N
Data  5 IC50
  Tab Delimited (TSV)   2D SDfile   Computed 3D by Vconf -m prep SDfile
Find this compound or compounds like it in BindingDB:
Activity Spreadsheet -- Enzyme Inhibition Constant Data from BindingDB
Found 5 hits for monomerid = 50159275
TargetCytochrome P450 2A6(Homo sapiens (Human))
University Of Kuopio
Curated by ChEMBL
LigandPNGBDBM50159275(1,6-DMN | 1,6-Dimethylnaphthalene | CHEMBL363803)
Affinity DataIC50:  1.30E+5nM. Assay description: Inhibitory concentration against human cytochrome P450 2A6
In DepthDetails ArticlePubMed
TargetCytochrome P450 2A6(Homo sapiens (Human))
University Of Kuopio
Curated by ChEMBL
LigandPNGBDBM50159275(1,6-DMN | 1,6-Dimethylnaphthalene | CHEMBL363803)
Affinity DataIC50:  1.30E+5nM. Assay description: Inhibition of human CYP2A6
In DepthDetails ArticlePubMed
TargetCytochrome P450 2A5(Mus musculus)
Jadavpur University
Curated by ChEMBL
LigandPNGBDBM50159275(1,6-DMN | 1,6-Dimethylnaphthalene | CHEMBL363803)
Affinity DataIC50:  3.20E+4nM. Assay description: Inhibition of mouse CYP2A5
In DepthDetails ArticlePubMed
TargetCytochrome P450 1A2(Homo sapiens (Human))
University Of Kuopio
Curated by ChEMBL
LigandPNGBDBM50159275(1,6-DMN | 1,6-Dimethylnaphthalene | CHEMBL363803)
Affinity DataIC50:  2.50E+4nM. Assay description: Inhibitory concentration against recombinant human cytochrome P450 1A2
In DepthDetails ArticlePubMed
TargetCytochrome P450 2A5(Mus musculus)
Jadavpur University
Curated by ChEMBL
LigandPNGBDBM50159275(1,6-DMN | 1,6-Dimethylnaphthalene | CHEMBL363803)
Affinity DataIC50:  3.20E+4nM. Assay description: Inhibitory concentration against mouse cytochrome P450 2A5
In DepthDetails ArticlePubMed