BDBM50159566 CHEMBL3786597
SMILES Cc1ccoc1C(=O)Nc1ccc(NC(=O)c2ccccc2C(O)=O)c(Cl)c1
InChI Key InChIKey=RTENVCBFDRQMCA-UHFFFAOYSA-N
Data  2 EC50
  Tab Delimited (TSV)   2D SDfile   Computed 3D by Vconf -m prep SDfile
Find this compound or compounds like it in BindingDB:
Activity Spreadsheet -- Enzyme Inhibition Constant Data from BindingDB
Found 2 hits for monomerid = 50159566
TargetMetabotropic glutamate receptor 1(Homo sapiens (Human))
Vanderbilt University Medical Center
Curated by ChEMBL
LigandPNGBDBM50159566(CHEMBL3786597)
Affinity DataEC50:  930nM. Assay description: Positive allosteric modulatory activity at human mGlu1 receptor expressed in wild type T-Rex293 cells assessed as increase in glutamate-induced calci...
In DepthDetails ArticlePubMed
TargetMetabotropic glutamate receptor 1(Homo sapiens (Human))
Vanderbilt University Medical Center
Curated by ChEMBL
LigandPNGBDBM50159566(CHEMBL3786597)
Affinity DataEC50:  933nM. Assay description: Positive allosteric modulatory activity at human mGlu1 receptor expressed in wild type T-Rex293 cells assessed as increase in glutamate-induced calci...
In DepthDetails ArticlePubMed