BDBM50159587 CHEMBL3787140
SMILES COc1cccc2C(=O)N(Cc12)c1ccc(NC(=O)c2occc2C)cc1Cl
InChI Key InChIKey=AXPKFWPLTXHKSI-UHFFFAOYSA-N
Data  2 EC50
  Tab Delimited (TSV)   2D SDfile   Computed 3D by Vconf -m prep SDfile
Find this compound or compounds like it in BindingDB:
Activity Spreadsheet -- Enzyme Inhibition Constant Data from BindingDB
Found 2 hits for monomerid = 50159587
TargetMetabotropic glutamate receptor 1(Homo sapiens (Human))
Vanderbilt University Medical Center
Curated by ChEMBL
LigandPNGBDBM50159587(CHEMBL3787140)
Affinity DataEC50: >1.00E+4nM. Assay description: Positive allosteric modulatory activity at human mGlu1 receptor expressed in wild type T-Rex293 cells assessed as increase in glutamate-induced calci...
In DepthDetails ArticlePubMed
TargetMetabotropic glutamate receptor 1(Homo sapiens (Human))
Vanderbilt University Medical Center
Curated by ChEMBL
LigandPNGBDBM50159587(CHEMBL3787140)
Affinity DataEC50: >1.00E+4nM. Assay description: Positive allosteric modulatory activity at human mGlu1 receptor expressed in wild type T-Rex293 cells assessed as increase in glutamate-induced calci...
In DepthDetails ArticlePubMed