BDBM50159692 CHEMBL3785499
SMILES Cc1scnc1C(=O)Nc1ccc(N2Cc3c(cccc3Cl)C2=O)c(Cl)c1
InChI Key InChIKey=WHFYJBKUEYVYEX-UHFFFAOYSA-N
Data  2 EC50
  Tab Delimited (TSV)   2D SDfile   Computed 3D by Vconf -m prep SDfile
Find this compound or compounds like it in BindingDB:
Activity Spreadsheet -- Enzyme Inhibition Constant Data from BindingDB
Found 2 hits for monomerid = 50159692
TargetMetabotropic glutamate receptor 1(Homo sapiens (Human))
Vanderbilt University Medical Center
Curated by ChEMBL
LigandPNGBDBM50159692(CHEMBL3785499)
Affinity DataEC50:  955nM. Assay description: Positive allosteric modulatory activity at human mGlu1 receptor expressed in wild type T-Rex293 cells assessed as increase in glutamate-induced calci...
In DepthDetails ArticlePubMed
TargetMetabotropic glutamate receptor 1(Homo sapiens (Human))
Vanderbilt University Medical Center
Curated by ChEMBL
LigandPNGBDBM50159692(CHEMBL3785499)
Affinity DataEC50:  954nM. Assay description: Positive allosteric modulatory activity at human mGlu1 receptor expressed in wild type T-Rex293 cells assessed as increase in glutamate-induced calci...
In DepthDetails ArticlePubMed