BDBM50159891 (R)-2-(3-Benzyl-3-methyl-ureido)-N-(3-morpholin-4-yl-propyl)-3-phenyl-propionamide::CHEMBL359885
SMILES CN(Cc1ccccc1)C(=O)N[C@H](Cc1ccccc1)C(=O)NCCCN1CCOCC1
InChI Key InChIKey=ALXVTDNMLPAWDU-HSZRJFAPSA-N
Data  1 KI
  Tab Delimited (TSV)   2D SDfile   Computed 3D by Vconf -m prep SDfile
Find this compound or compounds like it in BindingDB:
Activity Spreadsheet -- Enzyme Inhibition Constant Data from BindingDB
Found 1 hit for monomerid = 50159891
TargetSubstance-K receptor(Homo sapiens (Human))
Menarini Ricerche
Curated by ChEMBL
LigandPNGBDBM50159891((R)-2-(3-Benzyl-3-methyl-ureido)-N-(3-morpholin-4-...)
Affinity DataKi:  3.00E+3nM. Assay description: Bindining affinity for human tachykinin receptor 2 was measured by using [125I]-NKA as radio ligand
In DepthDetails ArticlePubMed