BDBM50160050 4-Methoxy-pyridine-2-carboxylic acid thiazol-2-ylamide::CHEMBL182901
SMILES COc1ccnc(c1)C(=O)Nc1nccs1
InChI Key InChIKey=XZFULFPDMOLHGZ-UHFFFAOYSA-N
Data  2 IC50
  Tab Delimited (TSV)   2D SDfile   Computed 3D by Vconf -m prep SDfile
Find this compound or compounds like it in BindingDB:
Activity Spreadsheet -- Enzyme Inhibition Constant Data from BindingDB
Found 2 hits for monomerid = 50160050
TargetMethionine aminopeptidase 1(Saccharomyces cerevisiae)
Chinese Academy Of Sciences
Curated by ChEMBL
LigandPNGBDBM50160050(4-Methoxy-pyridine-2-carboxylic acid thiazol-2-yla...)
Affinity DataIC50: >1.00E+5nM. Assay description: Inhibitory concentration against Saccharomyces cerevisiae methionine aminopeptidase 1
In DepthDetails ArticlePubMed
TargetMethionine aminopeptidase(Escherichia coli (strain K12))
Chinese Academy Of Sciences
Curated by ChEMBL
LigandPNGBDBM50160050(4-Methoxy-pyridine-2-carboxylic acid thiazol-2-yla...)
Affinity DataIC50:  9.22E+3nM. Assay description: Inhibitory concentration against Escherichia coli methionine aminopeptidase 1
In DepthDetails ArticlePubMed