BDBM50160441 Butane-1-sulfonic acid ((S)-1-{4-[4-methoxy-2-(4-methoxy-benzenesulfonyl)-benzenesulfonyl]-phenyl}-ethyl)-amide::CHEMBL360306
SMILES CCCCS(=O)(=O)N[C@@H](C)c1ccc(cc1)S(=O)(=O)c1ccc(OC)cc1S(=O)(=O)c1ccc(OC)cc1
InChI Key InChIKey=NLYIVSFQUCCHBG-IBGZPJMESA-N
Data  1 KI
  Tab Delimited (TSV)   2D SDfile   Computed 3D by Vconf -m prep SDfile
Find this compound or compounds like it in BindingDB:
Activity Spreadsheet -- Enzyme Inhibition Constant Data from BindingDB
Found 1 hit for monomerid = 50160441
TargetCannabinoid receptor 1(Homo sapiens (Human))
Schering-Plough Research Institute
Curated by ChEMBL
LigandPNGBDBM50160441(Butane-1-sulfonic acid ((S)-1-{4-[4-methoxy-2-(4-m...)
Affinity DataKi:  1.13E+3nM. Assay description: Binding affinity for cannabinoid receptor 1
In DepthDetails ArticlePubMed