BDBM50160857 1-Phenyl-1,7,9-triaza-spiro[4.5]decane-2,6,8,10-tetraone::CHEMBL178651
SMILES O=C1CCC2(N1c1ccccc1)C(=O)NC(=O)NC2=O
InChI Key InChIKey=XVIHAKHSIOBKFG-UHFFFAOYSA-N
Data  1 KI
  Tab Delimited (TSV)   2D SDfile   Computed 3D by Vconf -m prep SDfile
Find this compound or compounds like it in BindingDB:
Activity Spreadsheet -- Enzyme Inhibition Constant Data from BindingDB
Found 1 hit for monomerid = 50160857
TargetCollagenase 3(Homo sapiens (Human))
Pharmaceutical Research Institute
Curated by ChEMBL
LigandPNGBDBM50160857(1-Phenyl-1,7,9-triaza-spiro[4.5]decane-2,6,8,10-te...)
Affinity DataKi:  2.20E+3nM. Assay description: Inhibition of matrix metalloprotease-13
In DepthDetails ArticlePubMed