BDBM50161466 (R)-N-(1-{(S)-2-Carbamoyl-1-[2-(7-nitro-benzo[1,2,5]oxadiazol-4-ylamino)-ethylcarbamoyl]-ethylcarbamoyl}-cyclohexyl)-3-(4-phosphonomethyl-benzyl)-succinamic acid::CHEMBL362853
SMILES NC(=O)CC(NC(=O)C1(CCCCC1)NC(=O)C(CC(O)=O)Cc1ccc(C[P+](O)(O)[O-])cc1)C(=O)NCCNc1ccc([N+]([O-])=O)c2n[o+][n-]c12
InChI Key InChIKey=LKYLLHOSMFJONU-UHFFFAOYSA-N
Data  1 IC50  1 Kd  1 Koff  1 Kon
  Tab Delimited (TSV)   2D SDfile   Computed 3D by Vconf -m prep SDfile
Find this compound or compounds like it in BindingDB:
Activity Spreadsheet -- Enzyme Inhibition Constant Data from BindingDB
Found 1 hit for monomerid = 50161466
TargetGrowth factor receptor-bound protein 2(Homo sapiens (Human))
Nih
Curated by ChEMBL
LigandPNGBDBM50161466((R)-N-(1-{(S)-2-Carbamoyl-1-[2-(7-nitro-benzo[1,2,...)
Affinity DataIC50:  167nM. Assay description: Apparent dissociation constant for human growth factor receptor bound protein 2
In DepthDetails ArticlePubMed