BDBM50161728 CHEMBL3786014
SMILES O[C@@H]1[C@@H](CNC(=O)C2CC2)O[C@H]([C@H](O)[C@H]1O)n1cc(Cc2ccc(cc2)C2CC2)c2c(Cl)cccc12
InChI Key InChIKey=FOAMFDVMYDTVIE-HOZVGSINSA-N
Data  1 EC50
  Tab Delimited (TSV)   2D SDfile   Computed 3D by Vconf -m prep SDfile
Find this compound or compounds like it in BindingDB:
Activity Spreadsheet -- Enzyme Inhibition Constant Data from BindingDB
Found 1 hit for monomerid = 50161728
TargetSodium/glucose cotransporter 2(Homo sapiens (Human))
National Health Research Institutes
Curated by ChEMBL
LigandPNGBDBM50161728(CHEMBL3786014)
Affinity DataEC50:  552nM. Assay description: Inhibition of human SGLT2 expressed in CHO-K1 cells assessed as reduction in [14C]AMG uptake after 120 mins by scintillation counting method
In DepthDetails ArticlePubMed