BDBM50162117 2-(4-Benzyloxy-phenyl)-N-[2-(2-pyrrolidin-1-yl-ethyl)-2H-indazol-6-yl]-acetamide::CHEMBL179091
SMILES O=C(Cc1ccc(OCc2ccccc2)cc1)Nc1ccc2cn(CCN3CCCC3)nc2c1
InChI Key InChIKey=MRXDMWFDJNNKTP-UHFFFAOYSA-N
Data  1 IC50
  Tab Delimited (TSV)   2D SDfile   Computed 3D by Vconf -m prep SDfile
Find this compound or compounds like it in BindingDB:
Activity Spreadsheet -- Enzyme Inhibition Constant Data from BindingDB
Found 1 hit for monomerid = 50162117
TargetMelanin-concentrating hormone receptor 1(Homo sapiens (Human))
Abbott Laboratories
Curated by ChEMBL
LigandPNGBDBM50162117(2-(4-Benzyloxy-phenyl)-N-[2-(2-pyrrolidin-1-yl-eth...)
Affinity DataIC50:  146nM. Assay description: Inihibition of melanin concentrating hormone receptor 1 from human neuronal IMR-32 cells
In DepthDetails ArticlePubMed