BDBM50162560 CHEMBL369526::N-[4-(6,7-Dichloro-2-cyclopentyl-2-methyl-1-oxo-indan-5-yloxymethyl)-benzoyl]-methanesulfonamide
SMILES CC1(Cc2cc(OCc3ccc(cc3)C(=O)NS(C)(=O)=O)c(Cl)c(Cl)c2C1=O)C1CCCC1
InChI Key InChIKey=BFUGAQUBEYHYJS-UHFFFAOYSA-N
Data  1 EC50
  Tab Delimited (TSV)   2D SDfile   Computed 3D by Vconf -m prep SDfile
Find this compound or compounds like it in BindingDB:
Activity Spreadsheet -- Enzyme Inhibition Constant Data from BindingDB
Found 1 hit for monomerid = 50162560
TargetMetabotropic glutamate receptor 2(Homo sapiens (Human))
Merck Research Laboratories
Curated by ChEMBL
LigandPNGBDBM50162560(CHEMBL369526 | N-[4-(6,7-Dichloro-2-cyclopentyl-2-...)
Affinity DataEC50:  515nM. Assay description: Binding affinity against metabotropic glutamate receptor 2
In DepthDetails ArticlePubMed