BDBM50163013 1N-methyl-4-{2-chloro-6-[2-chloro-5-(3-hydroxy-1-propynyl)benzylamino]-9H-9-purinyl}-2,3-dihydroxy-(1S,2R,3S,4R,5S)-bicyclo[3.1.0]hexane-1-carboxamide::CHEMBL177753
SMILES CNC(=O)[C@]12C[C@@H]1[C@H]([C@H](O)[C@@H]2O)n1cnc2c(NCc3cc(ccc3Cl)C#CCO)nc(Cl)nc12
InChI Key InChIKey=PNZPFZXMXVXNCI-SZVPZISPSA-N
Data  1 KI
  Tab Delimited (TSV)   2D SDfile   Computed 3D by Vconf -m prep SDfile
Find this compound or compounds like it in BindingDB:
Activity Spreadsheet -- Enzyme Inhibition Constant Data from BindingDB
Found 1 hit for monomerid = 50163013
TargetAdenosine receptor A3(Homo sapiens (Human))
National Institute Of Diabetes And Digestive And Kidney Diseases
Curated by ChEMBL
LigandPNGBDBM50163013(1N-methyl-4-{2-chloro-6-[2-chloro-5-(3-hydroxy-1-p...)
Affinity DataKi:  217nM. Assay description: Inhibition of [125I]-AB-MECA binding to human Adenosine A3 receptor expressed in CHO cells
In DepthDetails ArticlePubMed