BDBM50165734 3-(4-(phenylsulfonyl)phenyl)-4-propyl-1H-1,2,4-triazole-5(4H)-thione::5-(4-Benzenesulfonyl-phenyl)-4-propyl-4H-[1,2,4]triazole-3-thiol::CHEMBL373072
SMILES CCCn1c(n[nH]c1=S)-c1ccc(cc1)S(=O)(=O)c1ccccc1
InChI Key InChIKey=AMQJGWYOHFKADK-UHFFFAOYSA-N
Data  3 KI
  Tab Delimited (TSV)   2D SDfile   Computed 3D by Vconf -m prep SDfile
Find this compound or compounds like it in BindingDB:
Activity Spreadsheet -- Enzyme Inhibition Constant Data from BindingDB
Found 3 hits for monomerid = 50165734
TargetCarbonic anhydrase 9(Homo sapiens (Human))
University Of Bucharest
Curated by ChEMBL
LigandPNGBDBM50165734(3-(4-(phenylsulfonyl)phenyl)-4-propyl-1H-1,2,4-tri...)
Affinity DataKi:  1.19E+5nM. Assay description: Inhibitory constant against human Carbonic anhydrase IX
In DepthDetails ArticlePubMed
TargetCarbonic anhydrase 2(Homo sapiens (Human))
University Of Bucharest
Curated by ChEMBL
LigandPNGBDBM50165734(3-(4-(phenylsulfonyl)phenyl)-4-propyl-1H-1,2,4-tri...)
Affinity DataKi:  2.76E+5nM. Assay description: Inhibitory constant against human Carbonic anhydrase II
In DepthDetails ArticlePubMed
TargetCarbonic anhydrase 1(Homo sapiens (Human))
University Of Bucharest
Curated by ChEMBL
LigandPNGBDBM50165734(3-(4-(phenylsulfonyl)phenyl)-4-propyl-1H-1,2,4-tri...)
Affinity DataKi:  2.90E+5nM. Assay description: Inhibitory constant against human Carbonic anhydrase I
In DepthDetails ArticlePubMed