BDBM50165746 5-[4-(4-Bromo-benzenesulfonyl)-phenyl]-4-m-tolyl-4H-[1,2,4]triazole-3-thiol::CHEMBL197320
SMILES Cc1cccc(c1)-n1c(n[nH]c1=S)-c1ccc(cc1)S(=O)(=O)c1ccc(Br)cc1
InChI Key InChIKey=BEHHSYPBCYNFLE-UHFFFAOYSA-N
Data  3 KI
  Tab Delimited (TSV)   2D SDfile   Computed 3D by Vconf -m prep SDfile
Find this compound or compounds like it in BindingDB:
Activity Spreadsheet -- Enzyme Inhibition Constant Data from BindingDB
Found 3 hits for monomerid = 50165746
TargetCarbonic anhydrase 1(Homo sapiens (Human))
University Of Bucharest
Curated by ChEMBL
LigandPNGBDBM50165746(5-[4-(4-Bromo-benzenesulfonyl)-phenyl]-4-m-tolyl-4...)
Affinity DataKi:  2.54E+5nM. Assay description: Inhibitory constant against human Carbonic anhydrase I
In DepthDetails ArticlePubMed
TargetCarbonic anhydrase 2(Homo sapiens (Human))
University Of Bucharest
Curated by ChEMBL
LigandPNGBDBM50165746(5-[4-(4-Bromo-benzenesulfonyl)-phenyl]-4-m-tolyl-4...)
Affinity DataKi:  3.01E+5nM. Assay description: Inhibitory constant against human Carbonic anhydrase II
In DepthDetails ArticlePubMed
TargetCarbonic anhydrase 9(Homo sapiens (Human))
University Of Bucharest
Curated by ChEMBL
LigandPNGBDBM50165746(5-[4-(4-Bromo-benzenesulfonyl)-phenyl]-4-m-tolyl-4...)
Affinity DataKi:  3.20E+5nM. Assay description: Inhibitory constant against human Carbonic anhydrase IX
In DepthDetails ArticlePubMed