BDBM50166875 CHEMBL3797377
SMILES Clc1cccc(OC(=O)N2CCC(CC2)c2nc(cs2)C2=NOC(C2)c2ccccc2)c1
InChI Key InChIKey=XHZOTXOZLCKNEB-UHFFFAOYSA-N
Data  1 KI  1 IC50
  Tab Delimited (TSV)   2D SDfile   Computed 3D by Vconf -m prep SDfile
Find this compound or compounds like it in BindingDB:
Activity Spreadsheet -- Enzyme Inhibition Constant Data from BindingDB
Found 1 hit for monomerid = 50166875
TargetFatty-acid amide hydrolase 1(Homo sapiens (Human))
E.I. Du Pont De Nemours
Curated by ChEMBL
LigandPNGBDBM50166875(CHEMBL3797377)
Affinity DataIC50:  0.410nM. Assay description: Inhibition of MBP-fused human recombinant FAAH with truncated N-terminal transmembrane domain expressed in Escherichia coli T7 using D-AMC substrate ...
In DepthDetails ArticlePubMed