BDBM50166878 CHEMBL3800599
SMILES Cc1ccc(OC(=O)N2CCC(CC2)c2nc(cs2)C2=NOC(C2)c2ccccc2)cc1
InChI Key InChIKey=RQSJCZHFJUREDK-UHFFFAOYSA-N
Data  1 KI  1 IC50
  Tab Delimited (TSV)   2D SDfile   Computed 3D by Vconf -m prep SDfile
Find this compound or compounds like it in BindingDB:
Activity Spreadsheet -- Enzyme Inhibition Constant Data from BindingDB
Found 2 hits for monomerid = 50166878
TargetFatty-acid amide hydrolase 1(Homo sapiens (Human))
E.I. Du Pont De Nemours
Curated by ChEMBL
LigandPNGBDBM50166878(CHEMBL3800599)
Affinity DataKi:  0.0190nM. Assay description: Inhibition of MBP-fused human recombinant FAAH with truncated N-terminal transmembrane domain expressed in Escherichia coli T7 using D-AMC substrate ...
In DepthDetails ArticlePubMed
TargetFatty-acid amide hydrolase 1(Homo sapiens (Human))
E.I. Du Pont De Nemours
Curated by ChEMBL
LigandPNGBDBM50166878(CHEMBL3800599)
Affinity DataIC50:  0.200nM. Assay description: Inhibition of MBP-fused human recombinant FAAH with truncated N-terminal transmembrane domain expressed in Escherichia coli T7 using D-AMC substrate ...
In DepthDetails ArticlePubMed