BDBM50167593 7-(4-Dimethylamino-phenyl)-6-(3-phenyl-propyl)-pyrido[2,3-d]pyrimidin-4-ylamine::CHEMBL192754
SMILES CN(C)c1ccc(cc1)-c1nc2ncnc(N)c2cc1CCCc1ccccc1
InChI Key InChIKey=XICUWRCHWQOBNS-UHFFFAOYSA-N
Data  1 IC50
  Tab Delimited (TSV)   2D SDfile   Computed 3D by Vconf -m prep SDfile
Find this compound or compounds like it in BindingDB:
Activity Spreadsheet -- Enzyme Inhibition Constant Data from BindingDB
Found 1 hit for monomerid = 50167593
TargetAdenosine kinase(Homo sapiens (Human))
Abbott Laboratories
Curated by ChEMBL
LigandPNGBDBM50167593(7-(4-Dimethylamino-phenyl)-6-(3-phenyl-propyl)-pyr...)
Affinity DataIC50:  2.23E+3nM. Assay description: Inhibitory concentration against Adenosine Kinase (enzyme)
In DepthDetails ArticlePubMed