BDBM50167775 (Z)-2-amino-2-(hydroxyimino)ethyl hydrogen phosphate::CHEMBL195976::Phosphoric acid mono-(N-hydroxycarbamimidoylmethyl) ester
SMILES ONC(=N)COP(O)(O)=O
InChI Key InChIKey=RGTWPXHBFMRQRP-UHFFFAOYSA-N
Data  2 KI
  Tab Delimited (TSV)   2D SDfile   Computed 3D by Vconf -m prep SDfile
Find this compound or compounds like it in BindingDB:
Activity Spreadsheet -- Enzyme Inhibition Constant Data from BindingDB
Found 2 hits for monomerid = 50167775
TargetTriosephosphate isomerase(Homo sapiens (Human))
Paris-Sud University
Curated by ChEMBL
LigandPNGBDBM50167775((Z)-2-amino-2-(hydroxyimino)ethyl hydrogen phospha...)
Affinity DataKi:  4.50E+3nM. Assay description: Inhibition of triosephosphate isomerase
In DepthDetails ArticlePubMed
TargetTriosephosphate isomerase(Oryctolagus cuniculus)
Paris-Sud University
Curated by ChEMBL
LigandPNGBDBM50167775((Z)-2-amino-2-(hydroxyimino)ethyl hydrogen phospha...)
Affinity DataKi:  4.50E+3nM. Assay description: Binding affinity against rabbit muscle triose-phosphate isomerase
In DepthDetails ArticlePubMed