BDBM50167954 CHEMBL195882::isobutylbenzene
SMILES CC(C)Cc1ccccc1
InChI Key InChIKey=KXUHSQYYJYAXGZ-UHFFFAOYSA-N
Data  1 Kd
PDB links: 1 PDB ID matches this monomer.
  Tab Delimited (TSV)   2D SDfile   Computed 3D by Vconf -m prep SDfile
Find this compound or compounds like it in BindingDB:
Activity Spreadsheet -- Enzyme Inhibition Constant Data from BindingDB
Found 1 hit for monomerid = 50167954
TargetEndolysin [L99A](Enterobacteria phage T4)
University Of California San Francisco
Curated by ChEMBL
LigandPNGBDBM50167954(CHEMBL195882 | isobutylbenzene)
Affinity DataKd:  1.90E+4nM. Assay description: Dissociation constant against T4 lysozyme mutant L99A
In DepthDetails ArticlePubMed