BDBM50168312 2-{4-[(16R,20S)-18-((S)-Carbamoylmethyl)-9-carboxymethyl-14-(5-methyl-indol-1-ylmethyl)-20-(S)-oxo-8,17-dioxo-7,16,19-triaza-spiro[5.14]icos-11-en-10-yl]-phenyl}-malonic acid::CHEMBL191728
SMILES Cc1ccc2n(C[C@H]3CNC(=O)[C@H](CC(N)=O)NC(=O)C4(CCCCC4)NC(=O)[C@@H](CC(O)=O)[C@H](\C=C\C3)c3ccc(cc3)C(C(O)=O)C(O)=O)ccc2c1
InChI Key InChIKey=ZUXPTLXJHBSAQT-YUAXJFSXSA-N
Data  1 IC50  1 Kd
  Tab Delimited (TSV)   2D SDfile   Computed 3D by Vconf -m prep SDfile
Find this compound or compounds like it in BindingDB:
Activity Spreadsheet -- Enzyme Inhibition Constant Data from BindingDB
Found 2 hits for monomerid = 50168312
TargetGrowth factor receptor-bound protein 2(Homo sapiens (Human))
National Cancer Institute-Frederick
Curated by ChEMBL
LigandPNGBDBM50168312(2-{4-[(16R,20S)-18-((S)-Carbamoylmethyl)-9-carboxy...)
Affinity DataIC50:  3.30nM. Assay description: Inhibitory concentration against growth factor receptor bound protein 2
In DepthDetails ArticlePubMed
TargetGrowth factor receptor-bound protein 2(Homo sapiens (Human))
National Cancer Institute-Frederick
Curated by ChEMBL
LigandPNGBDBM50168312(2-{4-[(16R,20S)-18-((S)-Carbamoylmethyl)-9-carboxy...)
Affinity DataKd:  3.62nM. Assay description: Dissociation constant value against growth factor receptor bound protein 2
In DepthDetails ArticlePubMed