BDBM50168446 2-{2-Methoxy-5-[(Z)-2-(3,4,5-trimethoxy-phenyl)-vinyl]-phenoxy}-ethanol::CHEMBL371487
SMILES COc1ccc(\C=C/c2cc(OC)c(OC)c(OC)c2)cc1OCCO
InChI Key InChIKey=LGJXOPCLIQGFGI-WAYWQWQTSA-N
Data  1 IC50
  Tab Delimited (TSV)   2D SDfile   Computed 3D by Vconf -m prep SDfile
Find this compound or compounds like it in BindingDB:
Activity Spreadsheet -- Enzyme Inhibition Constant Data from BindingDB
Found 1 hit for monomerid = 50168446
TargetTubulin beta-1 chain(Homo sapiens (Human))
Arizona State University
Curated by ChEMBL
LigandPNGBDBM50168446(2-{2-Methoxy-5-[(Z)-2-(3,4,5-trimethoxy-phenyl)-vi...)
Affinity DataIC50:  2.80E+3nM. Assay description: Inhibition of tubulin polymerization upon incubation for 20 min at 30 degree C
In DepthDetails ArticlePubMed