BDBM50168983 1-(1-Methyl-1H-pyrrol-2-yl)-2-piperidin-1-yl-propan-1-one::CHEMBL364917
SMILES CC(N1CCCCC1)C(=O)c1cccn1C
InChI Key InChIKey=XUNJRFJLOXYNRL-UHFFFAOYSA-N
Data  2 KI
  Tab Delimited (TSV)   2D SDfile   Computed 3D by Vconf -m prep SDfile
Find this compound or compounds like it in BindingDB:
Activity Spreadsheet -- Enzyme Inhibition Constant Data from BindingDB
Found 2 hits for monomerid = 50168983
TargetAmine oxidase [flavin-containing] A(Rattus norvegicus (rat))
Sapienza University Of Rome
Curated by ChEMBL
LigandPNGBDBM50168983(1-(1-Methyl-1H-pyrrol-2-yl)-2-piperidin-1-yl-propa...)
Affinity DataKi:  38nM. Assay description: Inhibtory concentration for rat Monoamine oxidase A
In DepthDetails ArticlePubMed
TargetAmine oxidase [flavin-containing] B(Homo sapiens (Human))
Sapienza University Of Rome
Curated by ChEMBL
LigandPNGBDBM50168983(1-(1-Methyl-1H-pyrrol-2-yl)-2-piperidin-1-yl-propa...)
Affinity DataKi:  3.60E+4nM. Assay description: Inhibitory concentration for human Monoamine oxidase B
In DepthDetails ArticlePubMed