BDBM50169 (6E)-6-[[(6-chloro-3-pyridazinyl)hydrazo]methylidene]-4-nitro-1-cyclohexa-2,4-dienone::(6E)-6-[[2-(6-chloranylpyridazin-3-yl)hydrazinyl]methylidene]-4-nitro-cyclohexa-2,4-dien-1-one::(6E)-6-[[2-(6-chloropyridazin-3-yl)hydrazinyl]methylidene]-4-nitrocyclohexa-2,4-dien-1-one::(6E)-6-[[N'-(6-chloropyridazin-3-yl)hydrazino]methylene]-4-nitro-cyclohexa-2,4-dien-1-one::2-hydroxy-5-nitrobenzaldehyde (6-chloro-3-pyridazinyl)hydrazone::MLS000573764::SMR000184399::cid_6183560
SMILES [O-][N+](=O)c1ccc(=O)[c-](C[NH+]=Nc2ccc(Cl)nn2)c1
InChI Key InChIKey=ZCKFMXVSQGTHJS-UHFFFAOYSA-O
Data  3 IC50
  Tab Delimited (TSV)   2D SDfile   Computed 3D by Vconf -m prep SDfile
Find this compound or compounds like it in BindingDB:
Activity Spreadsheet -- Enzyme Inhibition Constant Data from BindingDB
Found 3 hits for monomerid = 50169
TargetInduced myeloid leukemia cell differentiation protein Mcl-1(Homo sapiens (Human))
Emory University
Curated by PubChem BioAssay
LigandPNGBDBM50169((6E)-6-[[(6-chloro-3-pyridazinyl)hydrazo]methylide...)
Affinity DataIC50:  1.41E+4nM. Assay description: NIH Molecular Libraries Screening Centers Network [MLSCN] Emory Chemical Biology Discovery Center in MLSCN Assay provider: Nikolovska-Coleska, Univer...
In DepthDetails PCBioAssay
TargetType-1 angiotensin II receptor(Homo sapiens (Human))
Burnham Center For Chemical Genomics
Curated by PubChem BioAssay
LigandPNGBDBM50169((6E)-6-[[(6-chloro-3-pyridazinyl)hydrazo]methylide...)
Affinity DataIC50:  3.63E+3nM. Assay description: Data Source: Sanford-Burnham Center for Chemical Genomics (SBCCG) Source Affiliation: Sanford-Burnham Medical Research Institute(SBMRI, San Diego, C...
In DepthDetails PCBioAssay
TargetApelin receptor(Homo sapiens (Human))
Sanford-Burnham Center For Chemical Genomics
Curated by PubChem BioAssay
LigandPNGBDBM50169((6E)-6-[[(6-chloro-3-pyridazinyl)hydrazo]methylide...)
Affinity DataIC50:  4.18E+3nM. Assay description: Data Source: Sanford-Burnham Center for Chemical Genomics (SBCCG) Source Affiliation: Sanford- Sanford-Burnham Medical Research Institute(SBMRI, San...
In DepthDetails PCBioAssay