BDBM50169387 CHEMBL366703::N-(4'-{4-[3-(3,5-Dichloro-phenyl)-ureidomethyl]-1-methyl-piperidin-4-yl}-biphenyl-3-yl)-acetamide
SMILES CN1CCC(CNC(=O)Nc2cc(Cl)cc(Cl)c2)(CC1)c1ccc(cc1)-c1cccc(NC(C)=O)c1
InChI Key InChIKey=DQUWQGNVJJJULP-UHFFFAOYSA-N
Data  1 KI
  Tab Delimited (TSV)   2D SDfile   Computed 3D by Vconf -m prep SDfile
Find this compound or compounds like it in BindingDB:
Activity Spreadsheet -- Enzyme Inhibition Constant Data from BindingDB
Found 1 hit for monomerid = 50169387
TargetMelanin-concentrating hormone receptor 1(Homo sapiens (Human))
Pharmacopeia Drug Discovery
Curated by ChEMBL
LigandPNGBDBM50169387(CHEMBL366703 | N-(4'-{4-[3-(3,5-Dichloro-phenyl)-u...)
Affinity DataKi:  2.10nM. Assay description: Ability to displace [125-I]-MCH()0.5 nM from human MCH1R(2.5 uM) expressed in CHO cells
In DepthDetails ArticlePubMed