BDBM50169388 1-(3,5-Dichloro-phenyl)-3-[1-methanesulfonyl-4-(4-pyridin-3-yl-phenyl)-piperidin-4-ylmethyl]-urea::CHEMBL176079
SMILES CS(=O)(=O)N1CCC(CNC(=O)Nc2cc(Cl)cc(Cl)c2)(CC1)c1ccc(cc1)-c1cccnc1
InChI Key InChIKey=QKNZEPNKRCJQJI-UHFFFAOYSA-N
Data  1 KI
  Tab Delimited (TSV)   2D SDfile   Computed 3D by Vconf -m prep SDfile
Find this compound or compounds like it in BindingDB:
Activity Spreadsheet -- Enzyme Inhibition Constant Data from BindingDB
Found 1 hit for monomerid = 50169388
TargetMelanin-concentrating hormone receptor 1(Homo sapiens (Human))
Pharmacopeia Drug Discovery
Curated by ChEMBL
LigandPNGBDBM50169388(1-(3,5-Dichloro-phenyl)-3-[1-methanesulfonyl-4-(4-...)
Affinity DataKi:  2.20nM. Assay description: Ability to displace [125-I]-MCH()0.5 nM from human MCH1R(2.5 uM) expressed in CHO cells
In DepthDetails ArticlePubMed