BDBM501696 4-(2-(Dimethylamino)ethoxy)-6-((6-((4-methoxybenzyl)oxy)pyridin-3-yl)oxy)-2-methyl-9H-xanthen-9-one::US11028064, Example 10
SMILES CN(C)CCOc1cc(C)cc2c1oc1cc(Oc3ccc(OCc4ccc(CO)cc4)nc3)ccc1c2=O
InChI Key InChIKey=WBOSHXOLOFTRDZ-UHFFFAOYSA-N
Data  2 IC50
  Tab Delimited (TSV)   2D SDfile   Computed 3D by Vconf -m prep SDfile
Find this compound or compounds like it in BindingDB:
Activity Spreadsheet -- Enzyme Inhibition Constant Data from BindingDB
Found 2 hits for monomerid = 501696
TargetVascular endothelial growth factor receptor 2(Homo sapiens (Human))
Auckland Uniservices
US Patent
LigandPNGBDBM501696(4-(2-(Dimethylamino)ethoxy)-6-((6-((4-methoxybenzy...)
Affinity DataIC50: >1.00E+4nM. Assay description: IC50 values were determined using the Z′-LYTEŽ activity assay, with ATP concentration used at Km app for the specific assay (500 μM ATP fo...
Ligand InfoPC cidPC sid
In DepthDetails US Patent
TargetMacrophage colony-stimulating factor 1 receptor(Homo sapiens (Human))
Auckland Uniservices
US Patent
LigandPNGBDBM501696(4-(2-(Dimethylamino)ethoxy)-6-((6-((4-methoxybenzy...)
Affinity DataIC50: <100nM. Assay description: IC50 values were determined using the Z′-LYTEŽ activity assay, with ATP concentration used at Km app for the specific assay (500 μM ATP fo...
Ligand InfoPC cidPC sid
In DepthDetails US Patent