BDBM50169955 3-(2-Amino-ethyl)-5-[1-(4-ethoxy-phenyl)-meth-(Z)-ylidene]-thiazolidine-2,4-dione::3-(2-aminoethyl)-5-(4-ethoxybenzylidene)thiazolidine-2,4-dione::CHEMBL363555
SMILES CCOc1ccc(\C=C2/SC(=O)N(CCN)C2=O)cc1
InChI Key InChIKey=NBJOUCGADPALIB-XFXZXTDPSA-N
Data  4 IC50  1 Kd
  Tab Delimited (TSV)   2D SDfile   Computed 3D by Vconf -m prep SDfile
Find this compound or compounds like it in BindingDB:
Activity Spreadsheet -- Enzyme Inhibition Constant Data from BindingDB
Found 5 hits for monomerid = 50169955
TargetMitogen-activated protein kinase 1(Homo sapiens (Human))
University Of Maryland
Curated by ChEMBL
LigandPNGBDBM50169955(3-(2-Amino-ethyl)-5-[1-(4-ethoxy-phenyl)-meth-(Z)-...)
Affinity DataKd:  5.00E+3nM. Assay description: Dissociation constant for ERK2 kinase
In DepthDetails ArticlePubMed
TargetAmine oxidase [flavin-containing] B(Homo sapiens (Human))
Northeastern Ohio Universities Colleges Of Medicine And Pharmacy
Curated by ChEMBL
LigandPNGBDBM50169955(3-(2-Amino-ethyl)-5-[1-(4-ethoxy-phenyl)-meth-(Z)-...)
Affinity DataIC50:  82nM. Assay description: Inhibition of human recombinant MAOB by amplex red assay
In DepthDetails ArticlePubMed
TargetAmine oxidase [flavin-containing] B(Homo sapiens (Human))
Northeastern Ohio Universities Colleges Of Medicine And Pharmacy
Curated by ChEMBL
LigandPNGBDBM50169955(3-(2-Amino-ethyl)-5-[1-(4-ethoxy-phenyl)-meth-(Z)-...)
Affinity DataIC50:  82nM. Assay description: Inhibition of recombinant human MAO-B
In DepthDetails PubMed
TargetAmine oxidase [flavin-containing] B(Homo sapiens (Human))
Northeastern Ohio Universities Colleges Of Medicine And Pharmacy
Curated by ChEMBL
LigandPNGBDBM50169955(3-(2-Amino-ethyl)-5-[1-(4-ethoxy-phenyl)-meth-(Z)-...)
Affinity DataIC50:  82nM. Assay description: Inhibition of human recombinant MAO-B after 15 mins
In DepthDetails ArticlePubMed
TargetAmine oxidase [flavin-containing] A(Homo sapiens (Human))
Northeastern Ohio Universities Colleges Of Medicine And Pharmacy
Curated by ChEMBL
LigandPNGBDBM50169955(3-(2-Amino-ethyl)-5-[1-(4-ethoxy-phenyl)-meth-(Z)-...)
Affinity DataIC50:  1.04E+3nM. Assay description: Inhibition of human recombinant MAOA assessed as inhibition of kynuramine conversion to fluorescent metabolite 4-hydroxyquinoline by fluorimetry
In DepthDetails ArticlePubMed