BDBM50170196 CHEMBL182235::trans-N*2*-(4-{[(4-Bromo-2-trifluoromethoxy-benzyl)-methyl-amino]-methyl}-cyclohexylmethyl)-N*4*,N*4*-dimethyl-quinazoline-2,4-diamine
SMILES CN(CC1CCC(CNc2nc(N(C)C)c3ccccc3n2)CC1)Cc1ccc(Br)cc1OC(F)(F)F
InChI Key InChIKey=KSWFHJFVFLWBLC-UHFFFAOYSA-N
Data  3 IC50
  Tab Delimited (TSV)   2D SDfile   Computed 3D by Vconf -m prep SDfile
Find this compound or compounds like it in BindingDB:
Activity Spreadsheet -- Enzyme Inhibition Constant Data from BindingDB
Found 3 hits for monomerid = 50170196
TargetAlpha-2A adrenergic receptor(Homo sapiens (Human))
Taisho Pharmaceutical
Curated by ChEMBL
LigandPNGBDBM50170196(CHEMBL182235 | trans-N*2*-(4-{[(4-Bromo-2-trifluor...)
Affinity DataIC50:  44nM. Assay description: Inhibitory activity against alpha-2A adrenergic receptor by using [3H]MK-912 as radioligand expressed in COS-1 cells
In DepthDetails ArticlePubMed
TargetMelanin-concentrating hormone receptor 1(Homo sapiens (Human))
Taisho Pharmaceutical
Curated by ChEMBL
LigandPNGBDBM50170196(CHEMBL182235 | trans-N*2*-(4-{[(4-Bromo-2-trifluor...)
Affinity DataIC50:  5.60E+3nM. Assay description: Inhibitory activity against human CA-MCH-R1 (Melanin-concentrating hormone receptor 1) by using [125I](Phe13,Tyr19)MCH as radioligand expressed in HE...
In DepthDetails ArticlePubMed
TargetNeuropeptide Y receptor type 5(Homo sapiens (Human))
Taisho Pharmaceutical
Curated by ChEMBL
LigandPNGBDBM50170196(CHEMBL182235 | trans-N*2*-(4-{[(4-Bromo-2-trifluor...)
Affinity DataIC50: >1.00E+3nM. Assay description: Inhibitory activity against neuropeptide Y receptor type 5 by using [125I]PYY as radioligand expressed in COS-1 cells
In DepthDetails ArticlePubMed