BDBM50170811 (1R,4R,5R)-1,4,5-Trihydroxy-3-(3-hydroxy-phenyl)-cyclohex-2-enecarboxylic acid::CHEMBL189015
SMILES O[C@@H]1C[C@@](O)(C=C([C@H]1O)c1cccc(O)c1)C(O)=O
InChI Key InChIKey=XHSZRILSOKSGFY-WZRBSPASSA-N
Data  1 KI
  Tab Delimited (TSV)   2D SDfile   Computed 3D by Vconf -m prep SDfile
Find this compound or compounds like it in BindingDB:
Activity Spreadsheet -- Enzyme Inhibition Constant Data from BindingDB
Found 1 hit for monomerid = 50170811
Target3-dehydroquinate dehydratase(Mycobacterium tuberculosis)
Universidad De Santiago De Compostela
Curated by ChEMBL
LigandPNGBDBM50170811((1R,4R,5R)-1,4,5-Trihydroxy-3-(3-hydroxy-phenyl)-c...)
Affinity DataKi:  9.50E+4nMpH: 8.2Assay Description:Inhibition of Mycobacterium tuberculosis type II dehydroquinase at 25 degree C pH 8.2
In DepthDetails ArticlePubMed