BDBM50171740 2-[3-(4-Phenyl-3,6-dihydro-2H-pyridin-1-yl)-propyl]-4a,5,6,7,8,8a-hexahydro-3H-pyrido[4,3-d]pyrimidin-4-one::CHEMBL370171
SMILES O=C1N=C(CCCN2CCC(=CC2)c2ccccc2)NC2CCNCC12
InChI Key InChIKey=YUXOQHWVQKFINS-UHFFFAOYSA-N
Data  1 IC50
  Tab Delimited (TSV)   2D SDfile   Computed 3D by Vconf -m prep SDfile
Find this compound or compounds like it in BindingDB:
Activity Spreadsheet -- Enzyme Inhibition Constant Data from BindingDB
Found 1 hit for monomerid = 50171740
TargetPoly [ADP-ribose] polymerase 1(Homo sapiens (Human))
Fujisawa Pharmaceutical
Curated by ChEMBL
LigandPNGBDBM50171740(2-[3-(4-Phenyl-3,6-dihydro-2H-pyridin-1-yl)-propyl...)
Affinity DataIC50:  8.60E+3nM. Assay description: In vitro inhibitory concentration against Poly(ADP-ribose) polymerase 1
In DepthDetails ArticlePubMed